{"text_format":"1","workbook":"xlsx","n_sheets":10,"sheets":["Introduktion","Antaganden","Resultat","Detaljerade resultat","Beräkningsblad-->","Modell","Anställning med ersättning","Skatter","Tabeller metodbilaga","Listor"],"not_rendered":{"charts":8,"images":4,"macros":1,"external_links":0,"defined_names":4,"comments":0,"pivot_tables":0},"unopened":[],"bounds":{"document_bytes":16777216,"sheet_cells":100000,"rows_first":2000,"rows_last":500,"rows_between":2000,"halvings":0,"cell_chars":16384,"cell_head_chars":4096},"cells_cut":0,"cells_raw":0,"read":"whole","date_system":"1900"}

{"sheet":"Introduktion","index":0,"n_rows":21,"n_cols":10,"rows_kept":21,"cut":false,"hidden":false,"merged":[[5,1,5,10],[6,1,6,6],[8,1,8,7],[1,1,1,6],[20,5,20,6],[20,1,20,4]]}
[]
[null,"SAMHÄLLSEKONOMISK KALKYLMODELL FÖR SYSSELSÄTTNINGSKRAV\n"]
[]
[null,"Introduktion"]
[]
[null,"Syftet med modellen är att ge offentliga organisationer ett underlag gällande de ekonomiska konsekvenserna vid användning av sysselsättningskrav i upphandlingar. Beräkningsmodellen gör det möjligt att fördela dessa konsekvenser för olika aktörer samt samlat för samhället. Modellen kan fungera som ett verktyg för beslutfattare inför beslut om sysselsättningskrav i upphandling. Den kan också fungera som ett dialogverktyg mellan upphandlare, leverantörer och övriga relevanta myndigheter.\n\nModellen är en kalkylator som beräknar det samhällsekonomiska värdet av att en individ lämnar arbetslöshet för sysselsättning (anställning, lärlingsanställning eller praktik). Modellen beräknar det samhällsekonomiska värdet under tiden för sysselsättningskravet för olika målgrupper, fördelat för individ, kommun, myndigheter och samhället i stort. Modellen bygger på ett antagande om att individer som tar del av sysselsättningskravet hade fortsatt vara arbetslösa under tiden för sysselsättningskravet. Kalkylmodellen beräknar inte några dynamiska eller långsiktiga effekter  såsom att individer får högre sannolikhet till framtida anställning till följd av att de får arbetslivserfarenhet via sysselsättningskrav. För en genomgång av effekter som kan uppstå vid sysselsättningskrav se exempelvis Konkurrensverket (2017).  Med arbetslös åsyftas personer som är inskrivna på Arbetsförmedlingen och innefattar såväl öppet arbetslösa samt deltagare i etablerings- och arbetsmarknadspolitiska program.  \n\nAtt en individ går från arbetslöshet till sysselsättning medför ofta sociala effekter, såsom förbättrad hälsa, ökad känsla av sammanhang med mera. Intangibla effekter av detta slag inkluderas inte i denna modell eftersom de är svåra att uppskatta schablonmässigt men är ändock något som bör beaktas i samband med beslut om sysselsättningskrav. \n\nModellen har tagits fram av Ramboll på uppdrag av ESF-projektet Sysselsättning genom offentlig upphandling och bygger på tidigare framtagna modellen; Delander och Månsson (2007) och Delander och Ekberg (2010). Målbilden har varit en modell med hög anpassningsgrad för att den ska kunna användas för olika typer av sysselsättningskrav (anställning, lärling, praktik) och för olika målgrupper (ålder, tid i arbetslöshet och om individen är nyanländ). Modellen togs fram under 2019 men har därefter uppdaterats med värden för år 2022."]
[]
[]
[null,"Modellen innehåller kostnader och intäkter fördelat för följande aktörer:"]
[null,"Individ"]
[null,"Kommun"]
[null,"Region"]
[null,"Stat"]
[null,"Arbetsgivare"]
[]
{"$rows_left_out":7}
{"sheet":"Antaganden","index":1,"n_rows":46,"n_cols":8,"rows_kept":46,"cut":false,"hidden":false,"merged":[]}
[]
["ANTAGANDEN"]
[]
[null,"PARAMETER",null,"VÄRDE",null,"BESKRIVNING"]
[]
[null,"Upphandlande organisation",null,null,null,"Här anges vilken aktör som den upphandlade organisationen tillhör. Används för att fördela kostnader kopplade till upphandlingen."]
[]
[null,"Sysselsättningskravet",null,null," "]
[]
[null,"Sysselsättningskrav",null,null,null,"Här anges vilken typ av sysselsättningskrav som modellen ska utgå ifrån. Valet styr vilka parametrar som är relevanta att specificera (blåmarkerade)."]
[]
[null,"Antal månader",null,0,null,"Antalet månader som sysselsättningskravet gäller."]
[]
[null,"Antal tjänster",null,0,null,"Antalet tjänster som sysselsättningskravet gäller."]
[]
{"$rows_left_out":32}
{"sheet":"Resultat","index":2,"n_rows":61,"n_cols":9,"rows_kept":61,"cut":false,"hidden":false,"merged":[[59,1,59,8],[45,1,45,8],[49,1,49,8],[52,1,52,8],[56,1,56,8]]}
[]
[null,"RESULTAT"]
[]
[null,null,null,null,null,null,null,null,{"$f":"TODAY()","v":"2022-02-21"}]
[null,"BERÄKNINGSVÄRDEN"]
[]
[null,"Upphandlande organisation",{"$f":"IF(Antaganden!D6=0,\"-\",Antaganden!D6)","v":"-"},"Ålder",{"$f":"IF(Antaganden!D38=0,\"-\",Antaganden!D38)","v":"-"},"Bruttolön (handledare)",{"$f":"IF(Antaganden!D24=0,\"-\",Antaganden!D24)","v":"-"}]
[null,"Sysselsättningskrav",{"$f":"IF(Antaganden!D10=0,\"-\",Antaganden!D10)","v":"-"},"Tid i arbetslöshet",{"$f":"IF(Antaganden!D40=0,\"-\",Antaganden!D40)","v":"-"},"Tid för handledning",{"$f":"IF(Antaganden!D26=0,\"-\",Antaganden!D26)","v":"-"}]
[null,"Antal månader",{"$f":"IF(Antaganden!D12=0,\"-\",Antaganden!D12)","v":"-"},"Nyanländ",{"$f":"IF(Antaganden!D42=0,\"-\",Antaganden!D42)","v":"-"},"Administrationskostnad (arbetsgivare)",{"$f":"IF(Antaganden!D28=0,\"-\",Antaganden!D28)","v":"-"}]
[null,"Antal tjänster",{"$f":"IF(Antaganden!D14=0,\"-\",Antaganden!D14)","v":"-"},"A-kassa",{"$f":"IF(Antaganden!D44=0,\"-\",Antaganden!D44)","v":"-"},"Upphandlingskostnad",{"$f":"IF(Antaganden!D30=0,\"-\",Antaganden!D30)","v":"-"}]
[null,"Omfattning av tjänst",{"$f":"IF(Antaganden!D16=0,\"-\",Antaganden!D16)","v":1},"Bostadsbidrag",{"$f":"IF(Antaganden!D46=0,\"-\",Antaganden!D46)","v":"-"},"Bonus",{"$f":"IF(Antaganden!D34=0,\"-\",Antaganden!D34)","v":"-"}]
[null,"Bruttolön per månad",{"$f":"IF(Antaganden!D18=0,\"-\",Antaganden!D18)","v":"-"}]
[null,"Anställningsstöd",{"$f":"IF(Antaganden!D20=0,\"-\",Antaganden!D20)","v":"-"}]
[null,"Produktionsfaktor",{"$f":"IF(OR(Antaganden!D10=\"Anställning\",Antaganden!D10=\"Lärling\"),Antaganden!D22,\"-\")","v":"-"}]
[null,"Produktionsvärde (praktik)",{"$f":"IF(Antaganden!D10=\"Praktik\",Antaganden!D32,\"-\")","v":"-"}]
{"$rows_left_out":47}
{"sheet":"Detaljerade resultat","index":3,"n_rows":100,"n_cols":7,"rows_kept":100,"cut":false,"hidden":false,"merged":[[16,2,16,6],[85,1,85,7],[18,1,18,7],[39,6,39,7],[67,1,67,7]]}
[]
[null,"DETALJERADE RESULTAT"]
[]
[null,null,null,null,null,null,{"$f":"TODAY()","v":"2022-02-21"}]
[null,"BERÄKNINGSVÄRDEN"]
[]
[null,"Upphandlande organisation",{"$f":"IF(Antaganden!D6=0,\"-\",Antaganden!D6)","v":"-"},"Ålder",{"$f":"IF(Antaganden!D38=0,\"-\",Antaganden!D38)","v":"-"},"Bruttolön (handledare)",{"$f":"Antaganden!D24","v":0}]
[null,"Sysselsättningskrav",{"$f":"IF(Antaganden!D10=0,\"-\",Antaganden!D10)","v":"-"},"Tid i arbetslöshet",{"$f":"IF(Antaganden!D40=0,\"-\",Antaganden!D40)","v":"-"},"Tid för handledning",{"$f":"Antaganden!D26","v":0}]
[null,"Antal månader",{"$f":"Antaganden!D12","v":0},"Nyanländ",{"$f":"IF(Antaganden!D42=0,\"-\",Antaganden!D42)","v":"-"},"Administrationskostnad (arbetsgivare)",{"$f":"Antaganden!D28","v":0}]
[null,"Antal tjänster",{"$f":"Antaganden!D16*Antaganden!D14","v":0},"A-kassa",{"$f":"IF(Antaganden!D44=0,\"-\",Antaganden!D44)","v":"-"},"Upphandlingskostnad",{"$f":"Antaganden!D30","v":0}]
[null,"Omfattning av tjänst",{"$f":"IF(Antaganden!D16=0,\"-\",Antaganden!D16)","v":1},"Bostadsbidrag",{"$f":"IF(Antaganden!D46=0,\"-\",Antaganden!D46)","v":"-"},"Bonus",{"$f":"IF(Antaganden!D36=0,\"-\",Antaganden!D36)","v":"-"}]
[null,"Bruttolön per månad",{"$f":"IF(Antaganden!D18=0,\"-\",Antaganden!D18)","v":"-"}]
[null,"Anställningsstöd",{"$f":"IF(Antaganden!D20=0,\"-\",Antaganden!D20)","v":"-"}]
[null,"Produktionsfaktor",{"$f":"IF(OR(Antaganden!D10=\"Anställning\",Antaganden!D10=\"Lärling\"),Antaganden!D22,\"-\")","v":"-"}]
[null,"Produktionsvärde (praktik)",{"$f":"IF(Antaganden!D10=\"Praktik\",Antaganden!D32,\"-\")","v":"-"}]
{"$rows_left_out":86}
{"sheet":"Beräkningsblad-->","index":4,"n_rows":0,"n_cols":0,"rows_kept":0,"cut":false,"hidden":false,"merged":[]}

{"sheet":"Modell","index":5,"n_rows":102,"n_cols":43,"rows_kept":102,"cut":false,"hidden":false,"merged":[[4,41,4,42],[2,3,2,10],[4,27,4,28],[4,34,4,35],[4,38,4,39],[4,19,4,20],[4,16,4,17],[4,30,4,31],[4,13,4,14],[4,22,4,23]]}
[null,null,null,null,null,null,"Arbete"]
[]
["Organisation",{"$f":"Antaganden!D6","v":0},null,"Intäkts- och kostnadsposter"]
[null,null,null,null,1,2,3,4,5,6,7]
["Sysselsättningskrav",{"$f":"Antaganden!D10","v":0},null,null,"Samhället","Individer","Netto  (offentlig sektor)","Stat","Region","Kommun","Arbetsgivare",null,null,"Upphandlarkostnad",null,null,"Arbetsgivarkostnad (övrigt)",null,null,"Arbetsgivarstöd",null,null,"Lönekostnader/Intäkter Praktik",null,null,null,null,"Lönekostnader/Intäkter",null,null,"Lönekostnader/Intäkter (handledare)",null,null,null,"Fördelning av inkomst mellan aktörer",null,null,null,"Transfereringar innan",null,null,"Transfereringar efter"]
["Bruttolön per månad (heltid)",{"$f":"Antaganden!D18","v":0},null,"A","Summa 2-3, 7",null,"Summa 4-6"]
[null,null,null,"Produktionstillskott",null,null,null,null,null,null,null,null,null,"Administration (upphandling m.m.)",{"$f":"B30","v":0},null,null,null,null,"Anställning",null,null,"Antagen Bruttolön/månad",{"$f":"IF(B5=\"Praktik\",B27,0)","v":0},null,null,null,"Antagen Bruttolön/månad",{"$f":"IF(OR(B5=\"Anställning\",B5=\"Lärling\"),(B6*B15),0)","v":0},null,"Antagen Bruttolön/månad",{"$f":"B24","v":0},null,null,"Antagen Bruttolön/månad",{"$f":"IF(OR(B5=\"Anställning\",B5=\"Lärling\"),(B6*B15),0)","v":0},null,null,"Antagen bruttolön/månad",{"$f":"IF(OR(B5=\"Anställning\",B5=\"Lärling\"),(B6*B15),IF(B5=\"Praktik\",20000,0))","v":0},null,"Antagen bruttolön/månad",{"$f":"IF(OR(B5=\"Anställning\",B5=\"Lärling\"),(B6*B15),IF(B5=\"Praktik\",20000,0))","v":0}]
[null,null,null,"1. Ökad produktion av varor och tjänster",{"$f":"SUM(F8,G8,K8)","v":0},{"$f":"AC20","v":0},{"$f":"SUM(H8:J8)","v":0},{"$f":"--(IF(B5=\"Anställning\",(0.18*AC20),IF(B5=\"Lärling\",(AC24-AC20),IF(B5=\"Praktik\",(X24-X20)))))","v":0},null,null,{"$f":"--IF(B5=\"Anställning\",(-1)*AC20*(1-B25),IF(B5=\"Lärling\",(-1)*AC20*(1-B25),IF(B5=\"Praktik\",X20)))","v":0},null,null,"Adm. Kostnad per månad & person",{"$f":"IFERROR((-1)*O7/(B16*B17),0)","v":0},null,"Handledning",{"$f":"(-1)*AF16*B26","v":0},null,null,null,null,null,null,null,null,null,null,null,null,null,null,null,null,null,null,null,null,"Norm",{"$f":"IF(Antaganden!D10=\"\",0,AN39)","v":0},null,"Norm",{"$f":"IF(IF(Antaganden!D10=\"\",0,AN39)-AJ28>0,IF(Antaganden!D10=\"\",0,AN39)-AJ28,0)","v":0}]
["Ålder (20-23, 24-25, 26-65)",{"$f":"Antaganden!D38","v":0},null,"2. Ökad inbetalning av skatt: ",null,null,null,null,null,null,null,null,null,null,null,null,"Administration (upphandling m.m.)",{"$f":"IFERROR((-1)*B29/(B16*B17),0)","v":0},null,"Nystartsjobb",{"$f":"IF(AND(B5=\"Anställning\",B19=\"Ja\"),IF(B11=\"Ja\",IF(((AC13/12)*'Anställning med ersättning'!G5)<'Anställning med ersättning'!F5,((AC13/12)*'Anställning med ersättning'!G5),'Anställning med ersättning'!F5),IF(AND(B9=\"26-65\",B10=\"12-23 mån\",B11=\"Nej\"),IF(((AC13/12)*'Anställning med ersättning'!G12)<'Anställning med ersättning'!F12,((AC13/12)*'Anställning med ersättning'!G12),'Anställning med ersättning'!F12),IF(AND(B9=\"26-65\",B10=\"24-35 mån\",B11=\"Nej\"),IF(((AC13/12)*'Anställning med ersättning'!G13)<'Anställning med ersättning'!F13,((AC13/12)*'Anställning med ersättning'!G13),'Anställning med ersättning'!F13),IF(AND(B9=\"26-65\",B10=\"36- mån\",B11=\"Nej\"),IF(((AC13/12)*'Anställning med ersättning'!G14)<'Anställning med ersättning'!F14,((AC13/12)*'Anställning med ersättning'!G14),'Anställning med ersättning'!F14),IF(AND(B9=\"20-25\",OR(B10=\"6-11 mån\",B10=\"12-23 mån\"),B11=\"Nej\"),IF(((AC13/12)*'Anställning med ersättning'!G9)<'Anställning med ersättning'!F9,(AC13/12)*'Anställning med ersättning'!G9,'Anställning med ersättning'!F9),IF(AND(B9=\"20-25\",B10=\"24-35 mån\",B11=\"Nej\"),IF(((AC13/12)*'Anställning med ersättning'!G10)<'Anställning med ersättning'!F10,((AC13/12)*'Anställning med ersättning'!G10),'Anställning med ersättning'!F10),IF(AND(B9=\"20-25\",B10=\"36- mån\",B11=\"Nej\"),IF(((AC13/12)*'Anställning med ersättning'!G11)<'Anställning med ersättning'!F11,((AC13/12)*'Anställning med ersättning'!G11),'Anställning med ersättning'!F11),0))))))),0)*(-1)","v":0},null,null,null,null,null,null,null,null,null,null,null,null,null,"Beräkning av avgifter baserat på statsskuld.se",null,null,null,"Etableringsersättning",{"$f":"IF(AND($B$11=\"Ja\",B12=\"Nej\"),$AN$42,0)","v":0},null,"Etableringsersättning",{"$f":"IF(($AQ$8-$AQ$13)>AN9,AN9,($AQ$8-$AQ$13))","v":0}]
["Tid i arbetslöshet (<6 mån, 6-11 mån, 12-23 mån, 24- mån)",{"$f":"Antaganden!D40","v":0},null,"a. Inkomstskatt",{"$f":"SUM(F10,G10,K10)","v":0},{"$f":"SUM(AJ16,AJ17,AJ19,AJ20,AJ21)*(-1)","v":0},{"$f":"SUM(H10:J10)","v":0},{"$f":"SUM(AJ21)","v":0},{"$f":"SUM(AJ17)","v":0},{"$f":"SUM(AJ16)","v":0},0,null,null,"Bonus",{"$f":"B31","v":0},null,null,null,null,"Introduktionsjobb",{"$f":"IF(Antaganden!D10=\"Anställning\",(-1)*(IF(B20=\"Ja\",IF((B6*B15)>20000,'Anställning med ersättning'!L3,'Anställning med ersättning'!K3*Modell!AC16))),\"\")","v":""},null,"Arbetsgivares lönekostnader från verksamt.se",null,null,null,null,"Arbetsgivares lönekostnader från verksamt.se",null,null,"Arbetsgivares lönekostnader från verksamt.se",null,null,null,"Månadslön + Arbetsgivaravgift:",{"$f":"(AC11+AC12)/12+(SUM(AC13:AC14)/12)","v":0},null,null,"A-kassa",{"$f":"IFERROR(IF($B$12=\"Ja\",IF(AN7*(1/B15)*$AN$45<$AN$48,AN7*(1/B15)*$AN$45,$AN$48),0),0)","v":0},null,"A-kassa",{"$f":"IFERROR(IF($B$12=\"Ja\",IF(AQ7*(1/B15)*$AN$45<$AN$48,(1-B15)*AQ7*(1/B15)*$AN$45,(1-B15)*$AN$48),0),0)","v":0}]
["Nyanländ (Ja/Nej)",{"$f":"IF(Antaganden!D42=\"Ja\",\"Ja\",\"Nej\")","v":"Nej"},null,"b. Lagstadgade arbetsgivaravgifter (ink. försäkringar)",{"$f":"SUM(F11,G11,K11)","v":0},{"$f":"-1*SUM(AC13,AC14)/12","v":0},{"$f":"SUM(H11:J11)","v":0},{"$f":"SUM(AC13,AC14)/12","v":0},0,0,0,null,null,"Bonus per månad & person",{"$f":"IFERROR((-1)*O10/(B16),0)","v":0},null,"Kostnad",{"$f":"SUM(R7:R10)","v":0},null,"Yrkesintroduktion",{"$f":"IF(Antaganden!D10=\"Anställning\",IF(((IF(B21=\"Ja\",IF(B6*B15>20000,'Anställning med ersättning'!U3,(AC13/12)*'Anställning med ersättning'!T3)))+B15*'Anställning med ersättning'!W3)=2415,0,-1*((IF(B21=\"Ja\",IF(B6*B15>20000,'Anställning med ersättning'!U3,(AC13/12)*'Anställning med ersättning'!T3)))+B15*'Anställning med ersättning'!W3)),\"\")","v":""},null,"Lön/år",{"$f":"X7*11","v":0},null,null,null,"Lön/år",{"$f":"AC7*11","v":0},null,"Lön/år",{"$f":"AF7*11","v":0},null,null,"Månadslön:",{"$f":"(SUM(AC11,AC12)/12)","v":0},null,null,"Aktivitetsstöd",{"$f":"IF($B$11=\"Nej\",(IF(AND($B$12=\"Nej\",$B$9=\"26-65\"),$AN$57,0)),0)","v":0},null,"Aktivitetsstöd",{"$f":"IF(($AQ$8-$AQ$13)>AN11,AN11,($AQ$8-$AQ$13))","v":0}]
["A-kassa (Ja, Nej)",{"$f":"IF(Antaganden!D44=\"Ja\",\"Ja\",\"Nej\")","v":"Nej"},null,"c. Övriga skatter och avgifter",{"$f":"SUM(F12,G12,K12)","v":0},{"$f":"-1*SUM(AJ18,AJ26)","v":0},{"$f":"SUM(H12:J12)","v":0},{"$f":"SUM(AJ18,AJ26)","v":0},0,0,null,null,null,null,null,null,null,null,null,"Övriga stöd",null,null,"Semesterlön/år",{"$f":"(X7*11)*0.12","v":0},null,null,null,"Semesterlön/år",{"$f":"(AC7*11)*0.12","v":0},null,"Semesterlön/år",{"$f":"(AF7*11)*0.12","v":0},null,null,"Grundavdrag:",{"$f":"-1*LOOKUP((AJ11*12),Skatter!B:B,Skatter!D:D)/12","v":0},null,null,"Utvecklingsersättning",{"$f":"IF($B$11=\"Nej\",(IF(AND($B$12=\"Nej\",OR($B$9=\"20-23\",$B$9=\"24-25\")),$AN$59,0)),0)","v":0},null,"Utvecklingsersättning",{"$f":"IF(($AQ$8-$AQ$13)>AN12,AN12,($AQ$8-$AQ$13))","v":0}]
["Bostadsbidrag (Ja, Nej)",{"$f":"IF(Antaganden!D46=\"Ja\",\"Ja\",\"Nej\")","v":"Nej"},null,"B",null,null,null,null,null,null,null,null,null,"Kommun",{"$f":"IF(B3=\"Kommunal\",SUM(O8,O11),0)","v":0},null,null,null,null,null,null,null,"Arbetsgivaravgifter/år",{"$f":"X27*SUM(X11:X12)","v":0},null,null,null,"Arbetsgivaravgifter/år",{"$f":"IF(B9=\"20-23\",AC27,AC26)","v":0},null,"Arbetsgivaravgifter/år",{"$f":"AC28*SUM(AF11:AF12)","v":0},null,null,"Beskattningsbar lön:",{"$f":"IFERROR(SUM(AJ11:AJ12),0)","v":0},null,null,"Bostadsbidrag",{"$f":"IF($B$13=\"Nej\",0,$AN$61)","v":0},null,"Bostadsbidrag",{"$f":"IF($AQ$8>AN13,AN13,$AQ$8)","v":0}]
["Bruttolön per månad (heltid)",null,null,"Minskade utbetalningar av transfereringar",{"$f":"SUM(F14:G14)","v":0},{"$f":"(-1*(AN17-AQ17))","v":0},{"$f":"SUM(H14:J14)","v":0},{"$f":"SUM((AN10-AQ10),(AN11-AQ11),(AN12-AQ12),(AN13-AQ13),(AN9-AQ9),0)","v":0},null,{"$f":"AN14-AQ14","v":0},0,null,null,"Stat",{"$f":"IF(B3=\"Statlig\",SUM(O8,O11),0)","v":0},null,null,null,null,"Lärling",null,null,"Totalt Försäkringar enligt kollektivavtal / år",0,null,null,null,"Totalt Försäkringar enligt kollektivavtal / år",0,null,"Totalt Försäkringar enligt kollektivavtal / år",0,null,null,null,null,null,null,"Försörjningsstöd",{"$f":"IF(AN13+AN9+AN12+AN15-AN30>AN8,0,AN8-(AN13+AN9+AN12+AN15-AN30))","v":0},null,"Försörjningsstöd",{"$f":"IF(AQ13+AQ9+AQ12+AQ15-AQ30>AQ8,0,AQ8-(AQ13+AQ9+AQ12+AQ15-AQ30))","v":0}]
["Andel av heltid",{"$f":"Antaganden!D16","v":1},null,"C",null,null,null,null,null,null,null,null,null,"Region",{"$f":"IF(B3=\"Regional\",SUM(O8,O11),0)","v":0},null,null,null,null,"Lärlingsersättning",{"$f":"IF(Antaganden!D10=\"Lärling\",-(Modell!U28),\"\")","v":""},null,"Totalt lön och skatt/år",{"$f":"SUM(X11:X14)","v":0},null,null,null,"Totalt lön och skatt/år",{"$f":"SUM(AC11:AC14)","v":0},null,"Totalt lön och skatt/år",{"$f":"SUM(AF11:AF14)","v":0},null,null,"Skatter",null,null,null,"Beskattningsbara transfereringar",{"$f":"SUM(AN10,AN11)","v":0},null,"Beskattningsbara transfereringar",{"$f":"SUM(AQ10,AQ11)","v":0}]
{"$rows_left_out":88}
{"sheet":"Anställning med ersättning","index":6,"n_rows":28,"n_cols":23,"rows_kept":28,"cut":false,"hidden":false,"merged":[]}
[null,null,null,"Nystartsjobb",null,"Källa: Arbetsförmedlingen",null,null,null,"Introduktionsjobb",null,null,null,null,null,"Lönebidrag",null,null,null,"Yrkesintroduktion"]
["Nyanländ (Ja=1, Nej=0)","Ålder (antal år)","Arbetslöshetstid (Antal månader)","Ersättningskvot (av månadslön)","Ersättningskvot (av lönekostnad)","Ersättningsmax (heltid)","Ersättning (arbetsgivaravgifter)","Max bruttolön",null,"Ersättningskvot (av månadslön)","Ersättningskvot (av lönekostnad)","Ersättningsmax (heltid)","Ersättning för handledning","Max bruttolön",null,"Lönekostnad*arbetsförmåga","Övrig ersättning - Utvecklingsbidrag",null,null,"Ersättning (arbetsgivaravgifter)","Max ersättning","Max bruttolön (efter avdrag av handledning)","Övrig ersättning - Handledning (115 per dag)"]
["Ja","20-25","6-23",0.78549999999999998,null,16128.933333333332,3,20000,null,1.05135,0.8,21587.925333333333,2000,20000,null,"-",2800,null,null,1,6451.5733333333328,18750,{"$f":"115*21","v":2415}]
["Ja","20-25","24-35",0.78549999999999998,null,16128.933333333332,3,20000]
["Ja","20-25","36-",0.78549999999999998,null,16128.933333333332,3,20000]
["Ja","26-65","12-23",0.78549999999999998,null,16128.933333333332,3,20000]
["Ja","26-65","24-35",0.78549999999999998,null,16128.933333333332,3,20000]
["Ja","26-65","36-",0.78549999999999998,null,16128.933333333332,3,20000]
["Nej","20-25","6-23",0.31419999999999998,null,6451.5733333333328,2,20000]
["Nej","20-25","24-35",0.62839999999999996,null,12903.146666666666,2.5,20000]
["Nej","20-25","36-",0.78549999999999998,null,16128.933333333332,3,20000,null,null,null,null,null,null,null,null,null,null,null,"Du som arbetsgivare"]
["Nej","26-65","12-23",0.31419999999999998,null,6451.5733333333328,2,20000,null,null,null,null,null,null,null,null,null,null,null,"betalar för den arbetade tiden."]
["Nej","26-65","24-35",0.62839999999999996,null,12903.146666666666,2.5,20000,null,"Anställ den som",null,null,null,null,null,null,null,null,null,"står för handledningen eller utbildningen."]
["Nej","26-65","36-",0.78549999999999998,null,16128.933333333332,3,20000,null,"deltar i jobb- och utvecklingsgarantin eller",null,null,null,null,null,null,null,null,null,"tar fram en handlednings- eller utbildningsplan."]
[null,null,null,null,null,null,null,null,null,"har fyllt 20 år och som deltagit i Jobbgarantin för ungdomar i minst 200 ersättningsdagar eller",null,null,null,null,null,null,null,null,null,"behöver ett kollektivavtal för yrkesintroduktion eller ett hängavtal till ett sådant."]
{"$rows_left_out":14}
{"sheet":"Skatter","index":7,"n_rows":402,"n_cols":7,"rows_kept":402,"cut":false,"hidden":false,"merged":[[1,5,1,6]]}
[]
[null,null,"GRUNDAVDRAG 2022",null,null,"JOBBSKATTEAVDRAG 2022"]
[null,"Fast. ink från","Fast. ink till","Grundavdrag",null,"Inkomst","Jobbskatteavdrag"]
[null,0,20400,0,null,100000,0.11]
[null,20500,48100,20500,null,150000,0.1]
[null,48200,48600,20600,null,200000,9.6000000000000002E-2]
[null,48700,49100,20700,null,250000,9.0999999999999998E-2]
[null,49200,49600,20800,null,300000,8.7999999999999995E-2]
[null,49700,50100,20900,null,350000,8.5999999999999993E-2]
[null,50200,50600,21000,null,400000,8.1000000000000003E-2]
[null,50700,51100,21100,null,500000,6.5000000000000002E-2]
[null,51200,51600,21200,null,600000,5.3999999999999999E-2]
[null,51700,52100,21300,null,700000,4.4999999999999998E-2]
[null,52200,52600,21400,null,900000,2.8000000000000001E-2]
[null,52700,53100,21500,null,1100000,1.7000000000000001E-2]
{"$rows_left_out":388}
{"sheet":"Tabeller metodbilaga","index":8,"n_rows":12,"n_cols":17,"rows_kept":12,"cut":false,"hidden":false,"merged":[]}
[]
[]
[null,"Skatter & avgifter","Procent",null,null,"Tidigare bruttolön","Dag 1-100","101-200 dagar","201 -300 dagar",null,"Ålder","Bidrag","Ersättningsnivå",null,"Ålder (antal år)","Tid i arbetslöshet (månader)","Ersättning (arbetsgivaravgifter)"]
[null,"Kommunalskatt*",0.20669999999999999,null,null,"< 25 025 ","80% av tidigare lön","80 %, max 760 kr","70% av tidigare lön,  max 760 kr",null,"Över 25 år","Aktivitetsstöd","223 kr per dag",null,"20-25","6-23",2]
[null,"Regionsskattesats*",0.11559999999999999,null,null,"> 25 025 ","80% av tidigare lön, max 910","80 % av tidigare lön, max 760","70% av tidigare lön,  max 760 kr",null,"18-24 år","Utvecklingsersättning","162 kr per dag",null,"20-25","24-35",2.5]
[null,"TV-skatt",0.01,null,null,null,null,null,null,null,null,null,null,null,"20-25","36-",3]
[null,"Statlig skatt",0.2,null,null,"Tidigare bruttolön","Dag 1-100","101-200 dagar","201 -300 dagar",null,null,null,null,null,"26-65","12-23",2]
[null,"Värnskatt",null,null,null,"< 25 025 ","80% av tidigare lön","80 %, max 1 000 kr","70% av tidigare lön,  max 1 000 kr",null,null,null,null,null,"26-65","24-35",2.5]
[null,"Begravningsavgift*",2.6099999999999999E-3,null,null,"> 25 025 ","80% av tidigare lön, max 1 200 kr","80 % av tidigare lön, max 1 000 kr","70% av tidigare lön,  max 1 000 kr",null,null,null,null,null,"26-65","36-",3]
[null,"Not: Medelskattesatsen är ett viktat medelvärde för samtliga kommuner där skatteunderlaget har använts som vägningstal. \nKälla: Skatteverket och Statistiska Centralbyrån"]
[]
[null,null,null,null,"grundersättning",356,510]

{"sheet":"Listor","index":9,"n_rows":8,"n_cols":7,"rows_kept":8,"cut":false,"hidden":false,"merged":[]}
[]
["Organisation","Sysselsättningskrav","Anställningsstöd","Ålder","Tid i arbetslöshet","Nyanländ","A-kassa"]
[]
["Kommunal","Anställning","Introduktionsjobb","20-23","<6 mån","Ja","Ja"]
["Statlig","Lärling","Nystartsjobb","24-25","6-11 mån"]
["Regional","Praktik","Yrkesintroduktion","26-65","12-23 mån"]
[null,null,null,null,"24-35 mån"]
[null,null,null,null,"36- mån"]